{"text_format":"1","workbook":"xlsx","n_sheets":19,"sheets":["Report Information","Header_Template","Financial_Info_Template","Sch1 Entry","Sch1_Data","Sch1_Template","Sch1_Assembly","Sch1_No_Trans","Sch2 Entry","Sch2_Template","Sch2_Assembly","Sch3 Entry","Sch3_Template","Sch3_Assembly","Form 55","Form55_Template","Form55_No_Trans","XML_Data","Instructions"],"not_rendered":{"charts":0,"images":35,"macros":1,"external_links":0,"defined_names":7,"comments":0,"pivot_tables":0},"unopened":[],"bounds":{"document_bytes":16777216,"sheet_cells":100000,"rows_first":2000,"rows_last":500,"rows_between":2000,"halvings":0,"cell_chars":16384,"cell_head_chars":4096},"cells_cut":0,"cells_raw":0,"read":"whole","date_system":"1900"}

{"sheet":"Report Information","index":0,"n_rows":251,"n_cols":36,"rows_kept":251,"cut":false,"hidden":false,"merged":[]}
[null,null,null,null,null,null,null,null,null,null,null,null,null,null,null,"Paid Preparer Form",null,"Filer Information",null,"Transmission Information",null,"Report Details",null,"Validation",null,"Country Abbrev.","State Abbrev.","Process Type","Filer Type",null,"Software ID:","NE_CIGXML","Financial Information",null,"Sale to Fed Gov","Schedule Types"]
[null,null,null,null,null,null,null,null,null,null,null,null,null,null,null,"Business Name:","","Business Name:",null,"Transmission ID:",{"$f":"CONCATENATE(S10,TEXT(U14,\"mmddyyyyhhmm\"))","v":"103120191315"},"Amended Ret:",false,"Report Info Valid:",{"$f":"IF(SUM(COUNT(Header_Template!F:F),COUNT(Financial_Info_Template!F:F)=0),TRUE,FALSE)","v":true},null,null,"Test","Resident Wholesaler",null,"Version:","Ver. 1.0t","Account Type:","","Y","Tax Paid Purchases"]
[null,null,null,null,null,null,null,null,null,null,null,null,null,null,null,"Contact Name:",null,"In Care Of:",null,"Process Type:","","Disaster Relief:",false,"Schedule 1 Valid:",true,"AD","AK","Production","Non-Resident Wholesaler",null,"Save File Dir:",null,"Routing Transit Number:",null,null,"Tax Paid Sales"]
[null,null,null,null,null,null,null,null,null,null,null,null,null,null,null,"Address Line1:",null,"Address Line1:",null,"Agent Identifier:",null,"Return Type:",{"$f":"IF(W8<>\"\",IF(W8=\"PACT ACT filer\",\"ScheduleI\",\"Form55\"),\"\")","v":""},"Schedule 2 Valid:",true,"AE","AL",null,"PACT ACT Filer",null,"File Name:",{"$f":"CONCATENATE(\"CIG_REP\",TEXT(W5,\"yyyy-mm-dd \"),TEXT(NOW(),\"yyyymmdd s\"),\".xml\")","v":"CIG_REP1900-01-00 20191031 10.xml"},"Bank Account Number:",null,null,"Tax Paid Credits"]
[null,null,null,null,null,null,null,null,null,null,null,null,null,null,null,"Address Line2:",null,"Address Line2:",null,"(t)ETIN:",null,"Tax Pd Begin:",null,"Schedule 3 Valid:",true,"AF","AR","Suffix List",null,null,null,null,"Payment Amount:",null,null,"Untaxed Credits"]
[null,null,null,null,null,null,null,null,null,null,null,null,null,null,null,"City:",null,"City:",null,"(t)EFIN:",null,"Tax Pd End:",{"$f":"IF(W12=\"valid date\",IF(LEN(W5)=10,TEXT(EOMONTH(W5,0),\"mm/dd/yyyy\"),\"\"),\"\")","v":""},null,null,"AG","AZ",null,"Account Type",null,"Version","Date","Identification Number:","",null,"Untaxed Sales"]
[null,null,null,null,null,null,null,null,null,null,null,null,null,null,null,"State:",null,"State:",null,"(t)State EIN:",null,"Exp of Disaster Relief:",null,null,null,"AI","CA","JR","Checking",null,1,"2012-12-18","Account Holder Name:",null,null,"Untaxed Purchases"]
[null,null,null,null,null,null,null,null,null,null,"Save File Path:",null,"C:",null,null,"Zip:",null,"Zip:",null,"(o)EFIN",null,"Filer Type:",null,null,null,"AL","CO","SR","Savings",null,null,null,"Account Holder Type:",""]
[null,null,null,null,null,null,null,null,null,null,null,null,null,null,null,"E-Mail:",null,"EIN:",null,"(o)typecd",null,"TxPdBeg-TxPdEnd",{"$f":"IF(W12=\"valid date\",IFERROR(IF(W6<>\"\",\"Tax Period:   \"&TEXT(W5,\"mm/dd/yyyy\")&\" - \"&W6,\"Tax Period:\"),\"Tax Period:\"),\"Tax Period\")","v":"Tax Period"},null,null,"AM","CT","I",null,null,null,null,"Requested Payment Date:",""]
[null,null,null,null,null,null,null,null,null,null,null,null,null,null,null,"SSN:",null,"State EIN:",null,"(p)EFIN",null,"Amended Ret Indicator:",{"$f":"IF(W2=TRUE,\"X\",\"\")","v":""},null,null,"AO","DC","II","Account Holder Type",null,null,null,"Checking Type Indicator:",{"$f":"IF(AH2 = \"Checking\",\"X\",\"\")","v":""}]
{"$rows_left_out":242}
{"sheet":"Header_Template","index":1,"n_rows":136,"n_cols":8,"rows_kept":136,"cut":false,"hidden":true,"merged":[]}
["XML Code","Tag","Data","Display Line","Indent","Syntax Validate ","Required Validate","Type"]
["<?xml version=\"1.0\" encoding=\"UTF-8\" ?> ",null,null,"Y",1]
["<Transmission xmlns=\"http://www.irs.gov/efile\"> ",null,null,"Y",1]
[{"$f":"CONCATENATE(\"<TransmissionHeader recordCount=\"\"\",C4,\"\"\">\")","v":"<TransmissionHeader recordCount=\"1\">"},null,{"$f":"IF('Report Information'!U12<>\"\",'Report Information'!U12,\"1\")","v":1},"Y",2,{"$f":"IF(C4<>\"\",IF(ISERR(INT(C4)),1,IF(C4-INT(C4)>0,1,\"\")),\"\")","v":""},null,"Int"]
[{"$f":"CONCATENATE(\"<\",INDIRECT(\"B\"&ROW()),\">\",INDIRECT(\"C\"&ROW()),\"</\",INDIRECT(\"B\"&ROW()),\">\")","v":"<Jurisdiction>NE</Jurisdiction>"},"Jurisdiction",{"$f":"IF('Report Information'!U13<>\"\",'Report Information'!U13,\"\")","v":"NE"},{"$f":"IF(INDIRECT(\"C\"&ROW())<>\"\",\"Y\",\"N\")","v":"Y"},3,null,{"$f":"IF(INDIRECT(\"C\"&ROW())=\"\",\"1\",\"\")","v":""}]
[{"$f":"CONCATENATE(\"<\",INDIRECT(\"B\"&ROW()),\">\",INDIRECT(\"C\"&ROW()),\"</\",INDIRECT(\"B\"&ROW()),\">\")","v":"<TransmissionId>103120191315</TransmissionId>"},"TransmissionId",{"$f":"IF('Report Information'!U2<>\"\",'Report Information'!U2,\"\")","v":"103120191315"},{"$f":"IF(INDIRECT(\"C\"&ROW())<>\"\",\"Y\",\"N\")","v":"Y"},3,null,{"$f":"IF(INDIRECT(\"C\"&ROW())=\"\",1,\"\")","v":""}]
[{"$f":"CONCATENATE(\"<\",INDIRECT(\"B\"&ROW()),\">\",TEXT(INDIRECT(\"C\"&ROW()),\"yyyy-mm-ddTmm:HH:SS-\"\"05:00\"\"\"),\"</\",INDIRECT(\"B\"&ROW()),\">\")","v":"<Timestamp>2019-10-31T10:13:10-05:00</Timestamp>"},"Timestamp",{"$f":"IF('Report Information'!U14<>\"\",'Report Information'!U14,\"\")","v":"2019-10-31T13:15:09.630"},{"$f":"IF(INDIRECT(\"C\"&ROW())<>\"\",\"Y\",\"N\")","v":"Y"},3,null,{"$f":"IF(INDIRECT(\"C\"&ROW())=\"\",\"1\",\"\")","v":""}]
["<Transmitter>",null,null,{"$f":"IF(COUNTIF(INDIRECT(\"D\"&ROW()+1&\":D\"&ROW()+3),\"=\"&\"Y\")>0,\"Y\",\"N\")","v":"N"},3,null,{"$f":"IF(COUNTIF(D9:D11,\"Y\")>0,\"\",1)","v":1}]
["<ETIN></ETIN>","ETIN",{"$f":"IF('Report Information'!U5<>\"\",'Report Information'!U5,\"\")","v":""},{"$f":"IF(INDIRECT(\"C\"&ROW())<>\"\",\"Y\",\"N\")","v":"N"},4,{"$f":"IF(C9<>\"\",IF(ISERR(INT(C9)),1,IF(C9-INT(C9)>0,1,\"\")),\"\")","v":""},null,"Int"]
["<EFIN></EFIN>","EFIN",{"$f":"IF('Report Information'!U6<>\"\",'Report Information'!U6,\"\")","v":""},{"$f":"IF(INDIRECT(\"C\"&ROW())<>\"\",\"Y\",\"N\")","v":"N"},4,{"$f":"IF(C10<>\"\",IF(ISERR(INT(C10)),1,IF(C10-INT(C10)>0,1,\"\")),\"\")","v":""},null,"Int"]
{"$rows_left_out":127}
{"sheet":"Financial_Info_Template","index":2,"n_rows":14,"n_cols":7,"rows_kept":14,"cut":false,"hidden":true,"merged":[]}
["XML Code","Tag","Data","Display Line","Indent","Syntax Validate","Required Validate"]
["<FinancialTransaction>",null,null,{"$f":"IF(COUNTIF(INDIRECT(\"D\"&ROW()+1&\":D\"&ROW()+11),\"=\"&\"Y\")>0,\"Y\",\"N\")","v":"N"},1]
["<StatePayment>",null,null,{"$f":"IF(COUNTIF(INDIRECT(\"D\"&ROW()+1&\":D\"&ROW()+9),\"=\"&\"Y\")>0,\"Y\",\"N\")","v":"N"},2]
[{"$f":"CONCATENATE(\"<\",INDIRECT(\"B\"&ROW()),\">\",INDIRECT(\"C\"&ROW()),\"</\",INDIRECT(\"B\"&ROW()),\">\")","v":"<Checking></Checking>"},"Checking",{"$f":"'Report Information'!AH10","v":""},{"$f":"IF(INDIRECT(\"C\"&ROW())<>\"\",\"Y\",\"N\")","v":"N"},3,null,{"$f":"IF(AND(D2=\"Y\",D4=\"N\",D5=\"N\"),1,\"\")","v":""}]
[{"$f":"CONCATENATE(\"<\",INDIRECT(\"B\"&ROW()),\">\",INDIRECT(\"C\"&ROW()),\"</\",INDIRECT(\"B\"&ROW()),\">\")","v":"<Savings></Savings>"},"Savings",{"$f":"'Report Information'!AH11","v":""},{"$f":"IF(INDIRECT(\"C\"&ROW())<>\"\",\"Y\",\"N\")","v":"N"},3,null,{"$f":"IF(AND(D2=\"Y\",D4=\"N\",D5=\"N\"),1,\"\")","v":""}]
["<RoutingTransitNumber></RoutingTransitNumber>","RoutingTransitNumber",{"$f":"IF('Report Information'!AH3<>\"\",'Report Information'!AH3,\"\")","v":""},{"$f":"IF(INDIRECT(\"C\"&ROW())<>\"\",\"Y\",\"N\")","v":"N"},3,null,{"$f":"IF(AND(D2=\"Y\",D6=\"N\"),1,\"\")","v":""}]
[{"$f":"CONCATENATE(\"<\",INDIRECT(\"B\"&ROW()),\">\",INDIRECT(\"C\"&ROW()),\"</\",INDIRECT(\"B\"&ROW()),\">\")","v":"<BankAccountNumber></BankAccountNumber>"},"BankAccountNumber",{"$f":"IF('Report Information'!AH4<>\"\",'Report Information'!AH4,\"\")","v":""},{"$f":"IF(INDIRECT(\"C\"&ROW())<>\"\",\"Y\",\"N\")","v":"N"},3,null,{"$f":"IF(AND(D2=\"Y\",D7=\"N\"),1,\"\")","v":""}]
[{"$f":"CONCATENATE(\"<\",INDIRECT(\"B\"&ROW()),\">\",TEXT(INDIRECT(\"C\"&ROW()),\"0.00\"),\"</\",INDIRECT(\"B\"&ROW()),\">\")","v":"<PaymentAmount></PaymentAmount>"},"PaymentAmount",{"$f":"IF('Report Information'!AH5<>\"\",'Report Information'!AH5,\"\")","v":""},"N",3,null,{"$f":"IF(AND(D2=\"Y\",D8=\"N\"),1,\"\")","v":""}]
[{"$f":"CONCATENATE(\"<\",INDIRECT(\"B\"&ROW()),\">\",INDIRECT(\"C\"&ROW()),\"</\",INDIRECT(\"B\"&ROW()),\">\")","v":"<IdentificationNumber></IdentificationNumber>"},"IdentificationNumber",{"$f":"IF('Report Information'!AH6<>\"\",'Report Information'!AH6,\"\")","v":""},"N",3,null,{"$f":"IF(AND(D2=\"Y\",D9=\"N\"),1,\"\")","v":""}]
["<AccountHolderName></AccountHolderName>","AccountHolderName",{"$f":"IF('Report Information'!AH7<>\"\",'Report Information'!AH7,\"\")","v":""},"N",3]
{"$rows_left_out":5}
{"sheet":"Sch1 Entry","index":3,"n_rows":51,"n_cols":47,"rows_kept":51,"cut":false,"hidden":false,"merged":[]}
[null,null,null,null,null,null,null,null,null,null,null,null,null,null,null,null,null,null,null,null,null,null,null,null,null,null,null,null,null,null,null,null,null,null,null,null,null,null,null,null,null,null,null,null,null,"Show Foreign Fields:",false]
[null,null,null,null,null,null,null,null,null,null,null,null,null,null,null,null,null,null,null,null,null,null,null,null,null,null,null,null,null,null,null,null,null,null,null,null,null,null,null,null,null,null,null,null,null,"Available Rows:  ",{"$f":"COUNTA(Sch1_Table[[#All],[Column41]])","v":41}]
[]
[]
[]
[]
[]
[]
[null,"Type Of Cigarette Schedule","Invoice Date","Invoice Number","Name","Address Line 1","Address Line 2","City","State","ZIP Code","In Care Of Name","Sale to                                       Fed Govt","EIN","Price","Tax       Juris","UPC Number","Manufacturer","Brand Family","Total Cigarettes","Deliverer Name"," Deliverer                                       Address Line 1"," Deliverer                                       Address Line 2"," Deliverer                                       City","Del   State","Del             Zip Code","Deliverer                                        In Care Of Name","Deliverer                                        Phone","(f) Deliverer                                       Address Line 1","(f) Deliverer                                       Address Line 2","(f) Deliverer                                       City","(f) Deliverer ProvinceOrState","(f) Del                 Country","(f) Del              PostalCode","(f) InCareOfName","(f) Name                        AddressLine1","(f) Name                           AddressLine2","(f) Name                                             City","(f) Name ProvinceOrState","(f) Name                            Country","(f) Name PostalCode","(f) Name                     InCareOfName","Req Field  Validation","Req DelivererField  Validation"]
[null,null,null,null,null,null,null,null,null,null,null,null,null,null,null,null,null,null,null,null,null,null,null,null,null,null,null,null,null,null,null,null,null,null,null,null,null,null,null,null,null,{"$f":"IF(COUNTA(Sch1_Table[[#This Row],[Column1]:[Column40]])>0,\"Yes\",\"No\")","v":"No"},{"$f":"IF(COUNTA(Sch1_Table[[#This Row],[Column19]:[Column40]])>0,\"Yes\",\"No\")","v":"No"}]
{"$rows_left_out":42}
{"sheet":"Sch1_Data","index":4,"n_rows":3,"n_cols":63,"rows_kept":3,"cut":false,"hidden":true,"merged":[[1,29,1,38]]}
[]
[null,null,null,null,null,null,null,null,null,null,null,null,null,null,null,null,null,null,null,null,null,null,null,null,null,null,null,null,null,"Repeating"]
["Line Type:","<SchI>","<InvoiceHeader>","TypeOfCigSchI","InvoiceDate","InvoiceNumber","Name","<Address>","<USAddress>","AddressLine1","AddressLine2","City","State","ZIPCode","InCareOfName","</USAddress>","<ForeignAddress>","(f) AddressLine1","(f) AddressLine2","(f) City","(f) ProvinceOrState","(f) Country","(f) PostalCode","(f) InCareOfName","</ForeignAddress>","</Address>","SaletoFederalGovt","EIN","</InvoiceHeader>","<InvoiceDetail>","Price","<BrandDetail>","TaxJuristion","UPCNumber","Manufacturer","BrandFamily","TotalCigarettes","</BrandDetail>","</InvoiceDetail>","<Deliverer>","DelivererName","<DelivererAddress>","<USAddress>","AddressLine1","AddressLine2","City","State","ZIPCode","InCareOfName","</USAddress>","<ForeignAddress>","(f) AddressLine1","(f) AddressLine2","(f) City","(f) ProvinceOrState","(f) Country","(f) PostalCode","(f) InCareOfName","</ForeignAddress>","</DelivererAddress>","DelivererPhone","</Deliverer>","</SchI>"]

{"sheet":"Sch1_Template","index":5,"n_rows":63,"n_cols":8,"rows_kept":63,"cut":false,"hidden":true,"merged":[]}
["XML Code","Tag","Data","Display Line","Indent",null,"#Invoice:",{"$f":"SUM(COUNTIF(Sch1_Data!A:A,\"Beg\"),COUNTIF(Sch1_Data!A:A,\"Single\"))","v":0}]
["<SchI>",null,null,"Y",1]
["<InvoiceHeader>",null,null,{"$f":"IF(COUNTA(INDIRECT(\"C\"&ROW()&\":C\"&ROW()+26))>0,\"Y\",\"N\")","v":"N"},2]
[{"$f":"CONCATENATE(\"<\",INDIRECT(\"B\"&ROW()),\">\",INDIRECT(\"C\"&ROW()),\"</\",INDIRECT(\"B\"&ROW()),\">\")","v":"<TypeOfCigSchI></TypeOfCigSchI>"},"TypeOfCigSchI",null,{"$f":"IF(INDIRECT(\"C\"&ROW())<>\"\",\"Y\",\"N\")","v":"N"},3]
[{"$f":"CONCATENATE(\"<\",INDIRECT(\"B\"&ROW()),\">\",TEXT(INDIRECT(\"C\"&ROW()),\"YYYY-MM-DD\"),\"</\",INDIRECT(\"B\"&ROW()),\">\")","v":"<InvoiceDate>1900-01-00</InvoiceDate>"},"InvoiceDate",null,{"$f":"IF(INDIRECT(\"C\"&ROW())<>\"\",\"Y\",\"N\")","v":"N"},3]
[{"$f":"CONCATENATE(\"<\",INDIRECT(\"B\"&ROW()),\">\",INDIRECT(\"C\"&ROW()),\"</\",INDIRECT(\"B\"&ROW()),\">\")","v":"<InvoiceNumber></InvoiceNumber>"},"InvoiceNumber",null,{"$f":"IF(INDIRECT(\"C\"&ROW())<>\"\",\"Y\",\"N\")","v":"N"},3]
["<Name></Name>","Name",null,{"$f":"IF(INDIRECT(\"C\"&ROW())<>\"\",\"Y\",\"N\")","v":"N"},3]
["<Address>",null,null,{"$f":"IF(COUNTA(INDIRECT(\"C\"&ROW()&\":C\"&ROW()+18))>0,\"Y\",\"N\")","v":"N"},3]
["<USAddress>",null,null,{"$f":"IF(COUNTA(INDIRECT(\"C\"&ROW()&\":C\"&ROW()+7))>0,\"Y\",\"N\")","v":"N"},4]
[{"$f":"CONCATENATE(\"<\",INDIRECT(\"B\"&ROW()),\">\",INDIRECT(\"C\"&ROW()),\"</\",INDIRECT(\"B\"&ROW()),\">\")","v":"<AddressLine1></AddressLine1>"},"AddressLine1",null,{"$f":"IF(INDIRECT(\"C\"&ROW())<>\"\",\"Y\",\"N\")","v":"N"},5]
{"$rows_left_out":54}
{"sheet":"Sch1_Assembly","index":6,"n_rows":0,"n_cols":0,"rows_kept":0,"cut":false,"hidden":true,"merged":[]}

{"sheet":"Sch1_No_Trans","index":7,"n_rows":4,"n_cols":5,"rows_kept":4,"cut":false,"hidden":true,"merged":[]}
["XML Code","Tag","Data","Display Line","Indent"]
["<SchI>",null,null,"Y",1]
["<NoTransactions>X</NoTransactions>",null,null,"Y"]
["</SchI>",null,null,"Y",1]

{"sheet":"Sch2 Entry","index":8,"n_rows":33,"n_cols":7,"rows_kept":33,"cut":false,"hidden":false,"merged":[[27,1,27,2],[8,3,8,5],[32,1,32,2],[10,1,10,2],[11,1,11,2],[28,1,28,2],[29,1,29,2]]}
[]
[]
[]
[null,null,null,null,null,"`"]
[]
[]
[]
[]
[null,null,null,"Stamp Denominations (number of stamps)"]
[null,null,null,"Packs of 20","Packs of 25","Gross Value ","Req Field Validation"]
{"$rows_left_out":24}
{"sheet":"Sch2_Template","index":9,"n_rows":46,"n_cols":5,"rows_kept":46,"cut":false,"hidden":true,"merged":[]}
["XML Code","Tag","Data","Display Line","Indent"]
["<SchII>",null,null,"Y",1]
["<BeginningInventory>",null,null,{"$f":"IF(COUNTIF(INDIRECT(\"D\"&ROW()+1&\":D\"&ROW()+7),\"=\"&\"Y\")>0,\"Y\",\"N\")","v":"Y"},2]
[{"$f":"CONCATENATE(\"<\",INDIRECT(\"B\"&ROW()),\">\",INDIRECT(\"C\"&ROW()),\"</\",INDIRECT(\"B\"&ROW()),\">\")","v":"<StampsforPacksof20>0</StampsforPacksof20>"},"StampsforPacksof20",{"$f":"'Sch2 Entry'!D11","v":0},{"$f":"IF(INDIRECT(\"C\"&ROW())<>\"\",\"Y\",\"N\")","v":"Y"},3]
[{"$f":"CONCATENATE(\"<\",INDIRECT(\"B\"&ROW()),\">\",INDIRECT(\"C\"&ROW()),\"</\",INDIRECT(\"B\"&ROW()),\">\")","v":"<StampsforPacksof25>0</StampsforPacksof25>"},"StampsforPacksof25",{"$f":"'Sch2 Entry'!E11","v":0},"Y",3]
[{"$f":"CONCATENATE(\"<\",INDIRECT(\"B\"&ROW()),\">\",INDIRECT(\"C\"&ROW()),\"</\",INDIRECT(\"B\"&ROW()),\">\")","v":"<TribalStampsforPacksof20></TribalStampsforPacksof20>"},"TribalStampsforPacksof20",null,"N",3]
["<TribalStampsforPacksof25></TribalStampsforPacksof25>","TribalStampsforPacksof25",null,"N",3]
[{"$f":"CONCATENATE(\"<\",INDIRECT(\"B\"&ROW()),\">\",TEXT(INDIRECT(\"C\"&ROW()),\"0.00\"),\"</\",INDIRECT(\"B\"&ROW()),\">\")","v":"<GrossValue>0.00</GrossValue>"},"GrossValue",{"$f":"IF('Sch2 Entry'!F11<>0,'Sch2 Entry'!F11,\"0\")","v":"0"},"Y",3]
["<PrintingCharges></PrintingCharges>","PrintingCharges",null,"N",3]
["<ShippingCharges></ShippingCharges>","ShippingCharges",null,"N",3]
{"$rows_left_out":37}
{"sheet":"Sch2_Assembly","index":10,"n_rows":0,"n_cols":0,"rows_kept":0,"cut":false,"hidden":true,"merged":[]}

{"sheet":"Sch3 Entry","index":11,"n_rows":61,"n_cols":9,"rows_kept":61,"cut":false,"hidden":false,"merged":[]}
[null,null,null,null,null,null,null,null,{"$f":"COUNTA(Table2[[#All],[Column7]])","v":16}]
[null,null,null,null,null,null,null,null,{"$f":"COUNTA(Table3[[#All],[Column7]])","v":10}]
[null,null,null,null,null,null,null,null,{"$f":"COUNTA(Table4[[#All],[Column7]])","v":16}]
[]
[]
[]
[]
[]
[null,"Beginning Inventory"]
[null,"Tax Jurisdiction","UPC Number","Manufacturer","Brand Family","Total Cigarettes"]
{"$rows_left_out":52}
{"sheet":"Sch3_Template","index":12,"n_rows":31,"n_cols":5,"rows_kept":31,"cut":false,"hidden":true,"merged":[]}
["XML Code","Tag","Data","Display Line","Indent"]
["<SchIII>",null,null,"Y",1]
["<BeginningInventory>",null,null,{"$f":"IF(COUNTIF(INDIRECT(\"D\"&ROW()+1&\":D\"&ROW()+7),\"=\"&\"Y\")>0,\"Y\",\"N\")","v":"N"},2]
["<BrandDetail>",null,null,{"$f":"IF(COUNTIF(INDIRECT(\"D\"&ROW()+1&\":D\"&ROW()+5),\"=\"&\"Y\")>0,\"Y\",\"N\")","v":"N"},3]
[{"$f":"CONCATENATE(\"<\",INDIRECT(\"B\"&ROW()),\">\",INDIRECT(\"C\"&ROW()),\"</\",INDIRECT(\"B\"&ROW()),\">\")","v":"<TaxJurisdiction></TaxJurisdiction>"},"TaxJurisdiction",null,{"$f":"IF(INDIRECT(\"C\"&ROW())<>\"\",\"Y\",\"N\")","v":"N"},4]
["<UPCNumber></UPCNumber>","UPCNumber",null,{"$f":"IF(INDIRECT(\"C\"&ROW())<>\"\",\"Y\",\"N\")","v":"N"},4]
["<Manufacturer></Manufacturer>","Manufacturer",null,{"$f":"IF(INDIRECT(\"C\"&ROW())<>\"\",\"Y\",\"N\")","v":"N"},4]
["<BrandFamily></BrandFamily>","BrandFamily",null,{"$f":"IF(INDIRECT(\"C\"&ROW())<>\"\",\"Y\",\"N\")","v":"N"},4]
["<TotalCigarettes></TotalCigarettes>","TotalCigarettes",null,{"$f":"IF(INDIRECT(\"C\"&ROW())<>\"\",\"Y\",\"N\")","v":"N"},4]
["</BrandDetail>",null,null,{"$f":"IF(COUNTIF(INDIRECT(\"D\"&ROW()-1&\":D\"&ROW()-5),\"=\"&\"Y\")>0,\"Y\",\"N\")","v":"N"},3]
{"$rows_left_out":22}
{"sheet":"Sch3_Assembly","index":13,"n_rows":0,"n_cols":0,"rows_kept":0,"cut":false,"hidden":true,"merged":[]}

{"sheet":"Form 55","index":14,"n_rows":52,"n_cols":8,"rows_kept":52,"cut":false,"hidden":false,"merged":[]}
[]
[]
[]
[]
[]
[]
[]
[]
[]
[]
{"$rows_left_out":43}
{"sheet":"Form55_Template","index":15,"n_rows":11,"n_cols":5,"rows_kept":11,"cut":false,"hidden":true,"merged":[]}
["XML Code","Tag","Data","Display Line","Indent"]
["<NEForm55>",null,null,{"$f":"IF(COUNTIF(INDIRECT(\"D\"&ROW()+1&\":D\"&ROW()+8),\"=\"&\"Y\")>0,\"Y\",\"N\")","v":"Y"},1]
[{"$f":"CONCATENATE(\"<\",INDIRECT(\"B\"&ROW()),\">\",INDIRECT(\"C\"&ROW()),\"</\",INDIRECT(\"B\"&ROW()),\">\")","v":"<CigaretteInvtoAccountfor>0</CigaretteInvtoAccountfor>"},"CigaretteInvtoAccountfor",{"$f":"'Form 55'!H18","v":0},{"$f":"IF(INDIRECT(\"C\"&ROW())<>\"\",\"Y\",\"N\")","v":"Y"},2]
[{"$f":"CONCATENATE(\"<\",INDIRECT(\"B\"&ROW()),\">\",INDIRECT(\"C\"&ROW()),\"</\",INDIRECT(\"B\"&ROW()),\">\")","v":"<DeductionsfromCigaretteInv>0</DeductionsfromCigaretteInv>"},"DeductionsfromCigaretteInv",{"$f":"'Form 55'!H28","v":0},{"$f":"IF(INDIRECT(\"C\"&ROW())<>\"\",\"Y\",\"N\")","v":"Y"},2]
["<CigarettesSubjecttoTax>0</CigarettesSubjecttoTax>","CigarettesSubjecttoTax",{"$f":"'Form 55'!H30","v":0},{"$f":"IF(INDIRECT(\"C\"&ROW())<>\"\",\"Y\",\"N\")","v":"Y"},2]
[{"$f":"CONCATENATE(\"<\",INDIRECT(\"B\"&ROW()),\">\",TEXT(INDIRECT(\"C\"&ROW()),\"0.00\"),\"</\",INDIRECT(\"B\"&ROW()),\">\")","v":"<CigaretteTax>0.00</CigaretteTax>"},"CigaretteTax",{"$f":"'Form 55'!H32","v":0},{"$f":"IF(INDIRECT(\"C\"&ROW())<>\"\",\"Y\",\"N\")","v":"Y"},2]
[{"$f":"CONCATENATE(\"<\",INDIRECT(\"B\"&ROW()),\">\",TEXT(INDIRECT(\"C\"&ROW()),\"0.00\"),\"</\",INDIRECT(\"B\"&ROW()),\">\")","v":"<ValueofStampstoAccountfor>0.00</ValueofStampstoAccountfor>"},"ValueofStampstoAccountfor",{"$f":"'Form 55'!H39","v":0},"Y",2]
[{"$f":"CONCATENATE(\"<\",INDIRECT(\"B\"&ROW()),\">\",TEXT(INDIRECT(\"C\"&ROW()),\"0.00\"),\"</\",INDIRECT(\"B\"&ROW()),\">\")","v":"<ValueofDeductionsfromStampInv>0.00</ValueofDeductionsfromStampInv>"},"ValueofDeductionsfromStampInv",{"$f":"'Form 55'!H47","v":0},"Y",2]
[{"$f":"CONCATENATE(\"<\",INDIRECT(\"B\"&ROW()),\">\",TEXT(INDIRECT(\"C\"&ROW()),\"0.00\"),\"</\",INDIRECT(\"B\"&ROW()),\">\")","v":"<ValueofStampsUsedthisMonth>0.00</ValueofStampsUsedthisMonth>"},"ValueofStampsUsedthisMonth",{"$f":"'Form 55'!H49","v":0},"Y",2]
[{"$f":"CONCATENATE(\"<\",INDIRECT(\"B\"&ROW()),\">\",TEXT(INDIRECT(\"C\"&ROW()),\"0.00\"),\"</\",INDIRECT(\"B\"&ROW()),\">\")","v":"<CigaretteTaxDue>0.00</CigaretteTaxDue>"},"CigaretteTaxDue",{"$f":"'Form 55'!H51","v":0},"Y",2]
{"$rows_left_out":2}
{"sheet":"Form55_No_Trans","index":16,"n_rows":4,"n_cols":5,"rows_kept":4,"cut":false,"hidden":true,"merged":[]}
["XML Code","Tag","Data","Display Line","Indent"]
["<NEForm55>",null,null,"Y",1]
["<NoTransactions>X</NoTransactions>",null,null,"Y"]
["</NEForm55>",null,null,"Y",1]

{"sheet":"XML_Data","index":17,"n_rows":0,"n_cols":0,"rows_kept":0,"cut":false,"hidden":true,"merged":[]}

{"sheet":"Instructions","index":18,"n_rows":74,"n_cols":2,"rows_kept":74,"cut":false,"hidden":false,"merged":[]}
[]
[null,"Using the Excel Spreadsheet to create an XML file for Cigarette reporting:"]
[]
[null,"Technical Information:"]
[null,"This spreadsheet was designed using Microsoft Excel 2010.  The Nebraska Department of Revenue does not support other "]
[null,"versions of Microsoft Excel or other products."]
[]
[null,"You should download and save a copy of the spreadsheet."]
[null,"You must enable macros to use this spreadsheet."]
[]
{"$rows_left_out":64}